*Heading
** Job name: Sphere_test Model name: Model-1
** Generated by: Abaqus/CAE 6.13-1
*Preprint, echo=NO, model=NO, history=NO, contact=NO
**
** PARTS
**
*Part, name=Solid
*End Part
**
*Part, name=sphere
*Node
*Element, type=CAX3
*Element, type=CAX4
*Nset, nset=_PickedSet3, internal, generate
*Elset, elset=_PickedSet3, internal, generate
*Elset, elset=_Sphere_Surface_S4, internal
*Elset, elset=_Sphere_Surface_S2, internal
*Surface, type=ELEMENT, name=Sphere_Surface
_Sphere_Surface_S4, S4
_Sphere_Surface_S2, S2
** Section: Sphere
*Solid Section, elset=_PickedSet3, material=Material-1
*End Part
**
**
** ASSEMBLY
**
*Assembly, name=Assembly
**
*Instance, name=Solid-1, part=Solid
*Node
*Nset, nset=Solid-1-RefPt_, internal
*Surface, type=SEGMENTS, name=Solid_Surface
START,           0.,           0.
 LINE,          50.,           0.
*Rigid Body, ref node=Solid-1-RefPt_, analytical surface=Solid_Surface
*End Instance
**
*Instance, name=sphere-1, part=sphere
*End Instance
**
*Nset, nset=Lower, instance=sphere-1
*Elset, elset=Lower, instance=sphere-1
*Nset, nset=Ref_Point, instance=Solid-1
*Nset, nset=Upper, instance=sphere-1
*Elset, elset=Upper, instance=sphere-1
*Nset, nset=_PickedSet11, internal, instance=Solid-1
*Nset, nset=_PickedSet12, internal, instance=sphere-1
*Elset, elset=_PickedSet12, internal, instance=sphere-1
*Elset, elset=__PickedSurf10_S4, internal, instance=sphere-1
*Elset, elset=__PickedSurf10_S2, internal, instance=sphere-1
*Surface, type=ELEMENT, name=_PickedSurf10, internal
__PickedSurf10_S4, S4
__PickedSurf10_S2, S2
*End Assembly
**
** MATERIALS
**
*Material, name=Material-1
*Elastic
 31.85, 0.3
**
** INTERACTION PROPERTIES
**
*surface interaction, name=int, user, properties=4, depvar=1, unsymm
1.0,
0.0846, 2.75 , 0.01, 20
**
** BOUNDARY CONDITIONS
**
** Name: Fixed_Point Type: Displacement/Rotation
*Boundary
_PickedSet11, 1, 1
_PickedSet11, 2, 2
_PickedSet11, 6, 6
**
** INTERACTIONS
**
** Interaction: Int-1
*Contact Pair, interaction=int, type=SURFACE TO SURFACE
_PickedSurf10, Solid-1.Solid_Surface
** ----------------------------------------------------------------
**
** STEP: Approaching
**
*Step, name=Approaching, nlgeom=YES, inc=10000, unsymm=YES
*Static
0.001, 1., 1e-05, 0.001
**
** BOUNDARY CONDITIONS
**
** Name: Loading Type: Displacement/Rotation
*Boundary
_PickedSet12, 2, 2, -7.
**
** OUTPUT REQUESTS
**
*Restart, write, frequency=0
**
** FIELD OUTPUT: F-Output-1
**
*Output, field, variable=PRESELECT
**
** HISTORY OUTPUT: Lower
**
*Output, history
*Contact Output
CAREA, SDV
**
** HISTORY OUTPUT: Ref_Point
**
*Node Output, nset=Ref_Point
TF1, TF2
**
** HISTORY OUTPUT: Upper
**
*Node Output, nset=Upper
TF1, TF2, U1, U2
**
** HISTORY OUTPUT: H-Output-1
**
*Output, history, variable=PRESELECT
*End Step